freshness-n
type: LexicalEntry
canonical form: freshness
sense: 04933905-n
part of speech: noun

04933905-n
type: LexicalConcept
in scheme: en-word.net
definition: the property of being pure and fresh (as if newly made); not stale or deteriorated
example: she loved the freshness of newly baked bread
example: the freshness of the air revived him
ili: i62874
lexfile: noun.attribute
part of speech: noun
attribute: https://en-word.net/synset/01071383-a
hypernym: 04933604-n