property-n
type: LexicalEntry
canonical form: property
sense: 04923519-n
part of speech: noun

04923519-n
type: LexicalConcept
in scheme: en-word.net
definition: a basic or essential property shared by all members of a class
example: a study of the physical properties of atomic particles
ili: i62823
lexfile: noun.attribute
part of speech: noun
hypernym: 00024444-n