cunning-n
type: LexicalEntry
canonical form: cunning
sense: 04884083-n
part of speech: noun

04884083-n
type: LexicalConcept
in scheme: en-word.net
definition: crafty artfulness (especially in deception)
ili: i62613
lexfile: noun.attribute
part of speech: noun
hypernym: 04883900-n