speciousness-n
type: LexicalEntry
canonical form: speciousness
sense: 04882308-n
part of speech: noun

meretriciousness-n
type: LexicalEntry
canonical form: meretriciousness
sense: 04882308-n
part of speech: noun

04882308-n
type: LexicalConcept
in scheme: en-word.net
definition: an appearance of truth that is false or deceptive; seeming plausibility
example: the speciousness of his argument
ili: i62602
lexfile: noun.attribute
part of speech: noun
hypernym: 04882134-n