familiarity-n
type: LexicalEntry
canonical form: familiarity
sense: 04803540-n
part of speech: noun

04803540-n
type: LexicalConcept
in scheme: en-word.net
definition: usualness by virtue of being familiar or well known
ili: i62208
lexfile: noun.attribute
part of speech: noun
attribute: https://en-word.net/synset/00968795-a
attribute: https://en-word.net/synset/00969666-a
hypernym: 04803335-n