instability-n
type: LexicalEntry
canonical form: instability
sense: 04782986-n
part of speech: noun

unstableness-n
type: LexicalEntry
canonical form: unstableness
sense: 04782986-n
part of speech: noun

04782986-n
type: LexicalConcept
in scheme: en-word.net
definition: the quality or attribute of being unstable and irresolute
ili: i62109
lexfile: noun.attribute
part of speech: noun
hypernym: 04780421-n