gap-n
type: LexicalEntry
canonical form: gap
sense: 04760114-n
part of speech: noun

spread-n
type: LexicalEntry
canonical form: spread
sense: 04760114-n
part of speech: noun

04760114-n
type: LexicalConcept
in scheme: en-word.net
definition: a conspicuous disparity or difference as between two figures
example: gap between income and outgo
example: the spread between lending and borrowing costs
ili: i62002
lexfile: noun.attribute
part of speech: noun
hypernym: 04759785-n