consistency-n
type: LexicalEntry
canonical form: consistency
sense: 04753172-n
part of speech: noun

consistence-n
type: LexicalEntry
canonical form: consistence
sense: 04753172-n
part of speech: noun

04753172-n
type: LexicalConcept
in scheme: en-word.net
definition: a harmonious uniformity or agreement among things or parts
ili: i61964
lexfile: noun.attribute
part of speech: noun
hypernym: 04752610-n