sharpness-n
type: LexicalEntry
canonical form: sharpness
sense: 04727502-n
part of speech: noun

04727502-n
type: LexicalConcept
in scheme: en-word.net
definition: the quality of being keenly and painfully felt
example: the sharpness of her loss
ili: i61853
lexfile: noun.attribute
part of speech: noun
hypernym: 04727300-n