convenience-n
type: LexicalEntry
canonical form: convenience
sense: 04725839-n
part of speech: noun

04725839-n
type: LexicalConcept
in scheme: en-word.net
definition: the quality of being useful and convenient
example: they offered the convenience of an installment plan
ili: i61845
lexfile: noun.attribute
part of speech: noun
attribute: https://en-word.net/synset/00607261-a
attribute: https://en-word.net/synset/00607505-a
hypernym: 04722763-n