acuteness-n
type: LexicalEntry
canonical form: acuteness
sense: 04712884-n
part of speech: noun

04712884-n
type: LexicalConcept
in scheme: en-word.net
definition: the quality of having a sharp edge or point
ili: i61784
lexfile: noun.attribute
part of speech: noun
hypernym: 04712672-n