stigma-n
type: LexicalEntry
canonical form: stigma
sense: 04703433-n
part of speech: noun

04703433-n
type: LexicalConcept
in scheme: en-word.net
definition: a skin lesion that is a diagnostic sign of some disease
ili: i61735
lexfile: noun.attribute
part of speech: noun
hypernym: 04699505-n