dig-n
type: LexicalEntry
canonical form: dig
sense: 04700905-n
part of speech: noun

04700905-n
type: LexicalConcept
in scheme: en-word.net
definition: a small gouge (as in the cover of a book)
example: the book was in good condition except for a dig in the back cover
ili: i61718
lexfile: noun.attribute
part of speech: noun
hypernym: 04700732-n