binding-n
type: LexicalEntry
canonical form: binding
sense: 04696547-n
part of speech: noun

04696547-n
type: LexicalConcept
in scheme: en-word.net
definition: the capacity to attract and hold something
ili: i61694
lexfile: noun.attribute
part of speech: noun
hypernym: 04695595-n