collar-n
type: LexicalEntry
canonical form: collar
sense: 04688109-n
part of speech: noun

04688109-n
type: LexicalConcept
in scheme: en-word.net
definition: (zoology) an encircling band or marking around the neck of any animal
ili: i61651
lexfile: noun.attribute
part of speech: noun
domain topic: 06092831-n
hypernym: 04687822-n