diligence-n
type: LexicalEntry
canonical form: diligence
sense: 04680363-n
part of speech: noun

04680363-n
type: LexicalConcept
in scheme: en-word.net
definition: conscientiousness in paying proper attention to a task; giving the degree of care required in a given situation
ili: i61614
lexfile: noun.attribute
part of speech: noun
hypernym: 04679712-n