attentiveness-n
type: LexicalEntry
canonical form: attentiveness
sense: 04670561-n
part of speech: noun

04670561-n
type: LexicalConcept
in scheme: en-word.net
definition: the trait of being considerate and thoughtful of others
ili: i61571
lexfile: noun.attribute
part of speech: noun
hypernym: 04848589-n