thoughtfulness-n
type: LexicalEntry
canonical form: thoughtfulness
sense: 04667893-n
part of speech: noun

04667893-n
type: LexicalConcept
in scheme: en-word.net
definition: the trait of thinking carefully before acting
ili: i61556
lexfile: noun.attribute
part of speech: noun
attribute: https://en-word.net/synset/02427668-a
attribute: https://en-word.net/synset/02429304-a
hypernym: 04623416-n