approachability-n
type: LexicalEntry
canonical form: approachability
sense: 04663006-n
part of speech: noun

accessibility-n
type: LexicalEntry
canonical form: accessibility
sense: 04663006-n
part of speech: noun

04663006-n
type: LexicalConcept
in scheme: en-word.net
definition: the attribute of being easy to meet or deal with
ili: i61530
lexfile: noun.attribute
part of speech: noun
hypernym: 04661694-n