playfulness-n
type: LexicalEntry
canonical form: playfulness
sense: 04656618-n
part of speech: noun

fun-n
type: LexicalEntry
canonical form: fun
sense: 04656618-n
part of speech: noun

04656618-n
type: LexicalConcept
in scheme: en-word.net
definition: a disposition to find (or make) causes for amusement
example: her playfulness surprised me
example: he was fun to be with
ili: i61500
lexfile: noun.attribute
part of speech: noun
attribute: https://en-word.net/synset/02129139-a
attribute: https://en-word.net/synset/02130695-a
hypernym: 04655564-n