resistance-n
type: LexicalEntry
canonical form: resistance
sense: 04653729-n
part of speech: noun

04653729-n
type: LexicalConcept
in scheme: en-word.net
definition: (psychiatry) an unwillingness to bring repressed feelings into conscious awareness
ili: i61487
lexfile: noun.attribute
part of speech: noun
domain topic: 06065477-n
hypernym: 04652956-n