stone-n
type: LexicalEntry
canonical form: stone
sense: 04637315-n
part of speech: noun

04637315-n
type: LexicalConcept
in scheme: en-word.net
definition: a lack of feeling or expression or movement
example: he must have a heart of stone
example: her face was as hard as stone
ili: i61407
lexfile: noun.attribute
part of speech: noun
hypernym: 04636961-n