yawl-n
type: LexicalEntry
canonical form: yawl
sense: 04619730-n
part of speech: noun

dandy-n
type: LexicalEntry
canonical form: dandy
sense: 04619730-n
part of speech: noun

04619730-n
type: LexicalConcept
in scheme: en-word.net
definition: a sailing vessel with two masts; a small mizzen is aft of the rudderpost
ili: i61319
lexfile: noun.artifact
part of speech: noun
hypernym: 04135920-n