working-n
type: LexicalEntry
canonical form: working
sense: 04608831-n
part of speech: noun

workings-n
type: LexicalEntry
canonical form: workings
sense: 04608831-n
part of speech: noun

04608831-n
type: LexicalConcept
in scheme: en-word.net
definition: a mine or quarry that is being or has been worked
ili: i61255
lexfile: noun.artifact
part of speech: noun
hypernym: 03307066-n