workhorse-n
type: LexicalEntry
canonical form: workhorse
sense: 04608649-n
part of speech: noun

04608649-n
type: LexicalConcept
in scheme: en-word.net
definition: machine that performs dependably under heavy use
example: the IBM main frame computers have been the workhorse of the business world
ili: i61254
lexfile: noun.artifact
part of speech: noun
hypernym: 03705309-n