wind instrument-n
type: LexicalEntry
canonical form: wind instrument
sense: 04594218-n
part of speech: noun

wind-n-1
type: LexicalEntry
canonical form: wind
sense: 04594218-n
part of speech: noun

04594218-n
type: LexicalConcept
in scheme: en-word.net
definition: a musical instrument in which the sound is produced by an enclosed column of air that is moved by bellows or the human breath
ili: i61165
lexfile: noun.artifact
part of speech: noun
hypernym: 03806455-n
mero part: 02828000-n
mero part: 03800320-n