wicket-n
type: LexicalEntry
canonical form: wicket
sense: 04590155-n
part of speech: noun

04590155-n
type: LexicalConcept
in scheme: en-word.net
definition: cricket equipment consisting of a set of three stumps topped by crosspieces; used in playing cricket
ili: i61139
lexfile: noun.artifact
part of speech: noun
hypernym: 03136912-n