web-n
type: LexicalEntry
canonical form: web
sense: 04575999-n
part of speech: noun

04575999-n
type: LexicalConcept
in scheme: en-word.net
definition: a fabric (especially a fabric in the process of being woven)
ili: i61053
lexfile: noun.artifact
part of speech: noun
hypernym: 03314753-n