wash-n
type: LexicalEntry
canonical form: wash
sense: 04560531-n
part of speech: noun

wash drawing-n
type: LexicalEntry
canonical form: wash drawing
sense: 04560531-n
part of speech: noun

04560531-n
type: LexicalConcept
in scheme: en-word.net
definition: a watercolor made by applying a series of monochrome washes one over the other
ili: i60962
lexfile: noun.artifact
part of speech: noun
hypernym: 04565864-n