ware-n
type: LexicalEntry
canonical form: ware
sense: 04558126-n
part of speech: noun

04558126-n
type: LexicalConcept
in scheme: en-word.net
definition: articles of the same kind or material; usually used in combination: ‘silverware’, ‘software’
ili: i60950
lexfile: noun.artifact
part of speech: noun
hypernym: 00023083-n