villa-n
type: LexicalEntry
canonical form: villa
sense: 04542665-n
part of speech: noun

04542665-n
type: LexicalConcept
in scheme: en-word.net
definition: country house in ancient Rome consisting of residential quarters and farm buildings around a courtyard
ili: i60859
lexfile: noun.artifact
part of speech: noun
hypernym: 03123620-n