van-n
type: LexicalEntry
canonical form: van
sense: 04527775-n
part of speech: noun

04527775-n
type: LexicalConcept
in scheme: en-word.net
definition: (Great Britain) a closed railroad car that carries baggage or freight
ili: i60774
lexfile: noun.artifact
part of speech: noun
domain region: 08879115-n
hypernym: 02963378-n