upset-n
type: LexicalEntry
canonical form: upset
sense: 04522739-n
part of speech: noun

swage-n
type: LexicalEntry
canonical form: swage
sense: 04522739-n
part of speech: noun

04522739-n
type: LexicalConcept
in scheme: en-word.net
definition: a tool used to thicken or spread metal (the end of a bar or a rivet etc.) by forging or hammering or swaging
ili: i60744
lexfile: noun.artifact
part of speech: noun
hypernym: 04459089-n