trailer-n
type: LexicalEntry
canonical form: trailer
sense: 04474542-n
part of speech: noun

04474542-n
type: LexicalConcept
in scheme: en-word.net
definition: a large transport conveyance designed to be pulled by a truck or tractor
ili: i60455
lexfile: noun.artifact
part of speech: noun
hypernym: 03105141-n