trailer-n
type: LexicalEntry
canonical form: trailer
sense: 04474334-n
part of speech: noun

house trailer-n
type: LexicalEntry
canonical form: house trailer
sense: 04474334-n
part of speech: noun

04474334-n
type: LexicalConcept
in scheme: en-word.net
definition: a wheeled vehicle that can be pulled by a car or truck and is equipped for occupancy
ili: i60454
lexfile: noun.artifact
part of speech: noun
hypernym: 04583497-n