tower-n-1
type: LexicalEntry
canonical form: tower
sense: 04467365-n
part of speech: noun

04467365-n
type: LexicalConcept
in scheme: en-word.net
definition: a structure taller than its diameter; can stand alone or be attached to a larger building
ili: i60415
lexfile: noun.artifact
part of speech: noun
hypernym: 04348764-n