token-n
type: LexicalEntry
canonical form: token
sense: 04455632-n
part of speech: noun

04455632-n
type: LexicalConcept
in scheme: en-word.net
definition: a metal or plastic disk that can be redeemed or used in designated slot machines
ili: i60344
lexfile: noun.artifact
part of speech: noun
hypernym: 03213277-n