theodolite-n
type: LexicalEntry
canonical form: theodolite
sense: 04426208-n
part of speech: noun

transit-n
type: LexicalEntry
canonical form: transit
sense: 04426208-n
part of speech: noun

04426208-n
type: LexicalConcept
in scheme: en-word.net
definition: a surveying instrument for measuring horizontal and vertical angles, consisting of a small telescope mounted on a tripod
ili: i60167
lexfile: noun.artifact
part of speech: noun
hypernym: 04372571-n
mero part: 02699881-n