tack-n
type: LexicalEntry
canonical form: tack
sense: 04390217-n
part of speech: noun

04390217-n
type: LexicalConcept
in scheme: en-word.net
definition: a short nail with a sharp point and a large head
ili: i59945
lexfile: noun.artifact
part of speech: noun
hypernym: 03810284-n