stripper well-n
type: LexicalEntry
canonical form: stripper well
sense: 04347456-n
part of speech: noun

stripper-n
type: LexicalEntry
canonical form: stripper
sense: 04347456-n
part of speech: noun

04347456-n
type: LexicalConcept
in scheme: en-word.net
definition: an oil well whose production has declined to less than ten barrels a day
ili: i59700
lexfile: noun.artifact
part of speech: noun
hypernym: 03850880-n