string-n
type: LexicalEntry
canonical form: string
sense: 04345456-n
part of speech: noun

04345456-n
type: LexicalConcept
in scheme: en-word.net
definition: a collection of things threaded on a single strand, or as if threaded on a single strand
ili: i59690
lexfile: noun.artifact
part of speech: noun
hypernym: 07968050-n