strap-n
type: LexicalEntry
canonical form: strap
sense: 04340638-n
part of speech: noun

shoulder strap-n
type: LexicalEntry
canonical form: shoulder strap
sense: 04340638-n
part of speech: noun

04340638-n
type: LexicalConcept
in scheme: en-word.net
definition: a band that goes over the shoulder and supports a garment or bag
ili: i59664
lexfile: noun.artifact
part of speech: noun
hypernym: 02787241-n