stay-n
type: LexicalEntry
canonical form: stay
sense: 04314757-n
part of speech: noun

04314757-n
type: LexicalConcept
in scheme: en-word.net
definition: a thin strip of metal or bone that is used to stiffen a garment (e.g. a corset)
ili: i59507
lexfile: noun.artifact
part of speech: noun
hypernym: 04346369-n