Statue of Liberty-n
type: LexicalEntry
canonical form: Statue of Liberty
sense: 04314244-n
part of speech: noun

04314244-n
type: LexicalConcept
in scheme: en-word.net
definition: a large monumental statue symbolizing liberty on Liberty Island in New York Bay
ili: i59504
lexfile: noun.artifact
part of speech: noun
instance hypernym: 04313985-n
instance hypernym: 03749393-n