stake-n
type: LexicalEntry
canonical form: stake
sense: 04305903-n
part of speech: noun

04305903-n
type: LexicalConcept
in scheme: en-word.net
definition: a strong wooden or metal post with a point at one end so it can be driven into the ground
ili: i59451
lexfile: noun.artifact
part of speech: noun
hypernym: 03994528-n