square-n
type: LexicalEntry
canonical form: square
sense: 04298649-n
part of speech: noun

04298649-n
type: LexicalConcept
in scheme: en-word.net
definition: any artifact having a shape similar to a plane geometric figure with four equal sides and four right angles
example: a checkerboard has 64 squares
ili: i59410
lexfile: noun.artifact
part of speech: noun
hypernym: 00022119-n