spindle-n
type: LexicalEntry
canonical form: spindle
sense: 04284490-n
part of speech: noun

04284490-n
type: LexicalConcept
in scheme: en-word.net
definition: a stick or pin used to twist the yarn in spinning
ili: i59321
lexfile: noun.artifact
part of speech: noun
hypernym: 04324558-n