spider web-n
type: LexicalEntry
canonical form: spider web
sense: 04282667-n
part of speech: noun

spider's web-n
type: LexicalEntry
canonical form: spider's web
sense: 04282667-n
part of speech: noun

04282667-n
type: LexicalConcept
in scheme: en-word.net
definition: a web resembling the webs spun by spiders
ili: i59310
lexfile: noun.artifact
part of speech: noun
hypernym: 04575843-n