snake-n
type: LexicalEntry
canonical form: snake
sense: 04255138-n
part of speech: noun

04255138-n
type: LexicalConcept
in scheme: en-word.net
definition: something long, thin, and flexible that resembles a snake
ili: i59128
lexfile: noun.artifact
part of speech: noun
hypernym: 00002684-n