slot-n
type: LexicalEntry
canonical form: slot
sense: 04250498-n
part of speech: noun

04250498-n
type: LexicalConcept
in scheme: en-word.net
definition: a small slit (as for inserting a coin or depositing mail)
example: he put a quarter in the slot
ili: i59098
lexfile: noun.artifact
part of speech: noun
hypernym: 04249068-n